# Object detection with predefined set and DAHUA IP-CAM

**URL:** <https://discourse.nodered.org/t/object-detection-with-predefined-set-and-dahua-ip-cam/88914>\
**Category:** General\
**Created:** [24 June 2024 17:38 UTC](https://discourse.nodered.org/t/object-detection-with-predefined-set-and-dahua-ip-cam/88914 "2024-06-24T17:38:03Z")\
**Posts on this page:** 8\
**Page:** 1

<div class="post-metadata">

**Author:** ![oliver](https://avatars.discourse-cdn.com/v4/letter/o/85f322/32.png) [@oliver](https://discourse.nodered.org/u/oliver)\
**Post date:** [24 June 2024 17:38 UTC](https://discourse.nodered.org/t/object-detection-with-predefined-set-and-dahua-ip-cam/88914/1 "2024-06-24T17:38:03Z")

</div>

I manage to show my dahua IP cam frames in an image-preview node.  
Now I like to do object detection on every frame with yolo or tensorflow and coco nodes.  
All nodes mentioning tensorflow or yolo that I found in the palette seem not possible to install.  
I use node-red 3.1.7 and got the errors below :

Does someone have an idea why all nodes can not be installed without problems? Thx!

> **[TensorFlow in Node-RED - Node-RED AI Photo Booth Workshop](https://knolleary.net/node-red-workshop-photobooth/part3/adding-tf.html)**
>
> A workshop for creating an AI-infused photo booth application using Node-RED and TensorFlow.js

> **[node-red-contrib-tensorflow](https://flows.nodered.org/node/node-red-contrib-tensorflow)**
>
> TensorFlow.js nodes using pre-trained models

> **[node-red-contrib-tfjs-coco-ssd](https://flows.nodered.org/node/node-red-contrib-tfjs-coco-ssd)**
>
> A Node-RED node that uses tensorflowjs for object detection.

```auto
C:\Users\Wim\.node-red>npm i node-red-contrib-tfjs-coco-ssd
npm WARN deprecated npmlog@5.0.1: This package is no longer supported.
npm WARN deprecated rimraf@2.7.1: Rimraf versions prior to v4 are no longer supported
npm WARN deprecated are-we-there-yet@2.0.0: This package is no longer supported.
npm WARN deprecated gauge@3.0.2: This package is no longer supported.
npm ERR! code 1
npm ERR! path C:\Users\Wim\.node-red\node_modules\@tensorflow\tfjs-node
npm ERR! command failed
npm ERR! command C:\WINDOWS\system32\cmd.exe /d /s /c node scripts/install.js
npm ERR! CPU-windows-3.21.1.zip
npm ERR! https://storage.googleapis.com/tensorflow/libtensorflow/libtensorflow-cpu-windows-x86_64-2.9.1.zip
npm ERR! * Downloading libtensorflow
npm ERR!
npm ERR! * Building TensorFlow Node.js bindings
npm ERR! symlink ./lib/napi-v9 failed: Error: Command failed: node scripts/deps-stage.js symlink ./lib/napi-v9
npm ERR! * Symlink of lib\napi-v9\tensorflow.dll failed, creating a copy on disk.
npm ERR! node:internal/process/promises:289
npm ERR! triggerUncaughtException(err, true /* fromPromise */);
npm ERR! ^
npm ERR!
npm ERR! [Error: ENOENT: no such file or directory, copyfile 'C:\Users\Wim\.node-red\node_modules\@tensorflow\tfjs-node\deps\lib\tensorflow.dll' -> 'C:\Users\Wim\.node-red\node_modules\@tensorflow\tfjs-node\lib\napi-v9\tensorflow.dll'] {
npm ERR! errno: -4058,
npm ERR! code: 'ENOENT',
npm ERR! syscall: 'copyfile',
npm ERR! path: 'C:\\Users\\Wim\\.node-red\\node_modules\\@tensorflow\\tfjs-node\\deps\\lib\\tensorflow.dll',
npm ERR! dest: 'C:\\Users\\Wim\\.node-red\\node_modules\\@tensorflow\\tfjs-node\\lib\\napi-v9\\tensorflow.dll'
npm ERR! }
npm ERR!
npm ERR! Node.js v20.11.1
npm ERR!
npm ERR! at ChildProcess.exithandler (node:child_process:422:12)
npm ERR! at ChildProcess.emit (node:events:518:28)
npm ERR! at maybeClose (node:internal/child_process:1105:16)
npm ERR! at ChildProcess._handle.onexit (node:internal/child_process:305:5) {
npm ERR! code: 1,
npm ERR! killed: false,
npm ERR! signal: null,
npm ERR! cmd: 'node scripts/deps-stage.js symlink ./lib/napi-v9'
npm ERR! }

npm ERR! A complete log of this run can be found in: C:\Users\Wim\AppData\Local\npm-cache\_logs\2024-06-24T17_23_32_216Z-debug-0.log

```

---

<div class="post-metadata">

**Author:** ![Steve-Mcl](https://sea2.discourse-cdn.com/flex026/user_avatar/discourse.nodered.org/steve-mcl/32/4826_2.png) [@Steve-Mcl](https://discourse.nodered.org/u/Steve-Mcl)\
**Post date:** [24 June 2024 19:23 UTC](https://discourse.nodered.org/t/object-detection-with-predefined-set-and-dahua-ip-cam/88914/2 "2024-06-24T19:23:06Z")

</div>

> [@oliver](#):
>
> `Node.js v20.11.1`

Your node js version ↑

  

> [@oliver](#):
>
> `symlink ./lib/napi-v9 failed`

searching this ↑ lead to this: [Cant install on windows 11 · Issue #7793 · tensorflow/tfjs · GitHub](https://github.com/tensorflow/tfjs/issues/7793#issuecomment-1873824835) which says it is a known issue & to use an earlier version of nodeJS. Note it does say use v19 or v18 but Node-RED is not tested against V19 (so if you intend on rolling back Node version, chose v18)

Lastly, this is not an issue on Linux. If you have a different computer running linux then that would be my first recommendation.

---

<div class="post-metadata">

**Author:** ![oliver](https://avatars.discourse-cdn.com/v4/letter/o/85f322/32.png) [@oliver](https://discourse.nodered.org/u/oliver)\
**Post date:** [25 June 2024 15:03 UTC](https://discourse.nodered.org/t/object-detection-with-predefined-set-and-dahua-ip-cam/88914/3 "2024-06-25T15:03:41Z")

</div>

Thanks for your help I install nvm and now use node v18.20.3 but still got the error

```auto

-----------------------------------------------------------
2024-06-25T15:00:31.489Z Install : node-red-contrib-tfjs-coco-ssd 1.0.6

2024-06-25T15:00:31.807Z npm.cmd install --no-audit --no-update-notifier --no-fund --save --save-prefix=~ --omit=dev --engine-strict node-red-contrib-tfjs-coco-ssd@1.0.6
2024-06-25T15:00:40.824Z [err] npm warn deprecated npmlog@5.0.1: This package is no longer supported.
2024-06-25T15:00:40.855Z [err] npm warn deprecated rimraf@2.7.1: Rimraf versions prior to v4 are no longer supported
2024-06-25T15:00:40.906Z [err] npm warn deprecated are-we-there-yet@2.0.0: This package is no longer supported.
2024-06-25T15:00:41.029Z [err] npm warn deprecated gauge@3.0.2: This package is no longer supported.
2024-06-25T15:01:13.948Z [err] npm error code 1
2024-06-25T15:01:13.948Z [err] npm error path C:\Users\Wim\.node-red\node_modules\@tensorflow\tfjs-node
2024-06-25T15:01:13.951Z [err] npm error command failed
2024-06-25T15:01:13.951Z [err] npm error command C:\WINDOWS\system32\cmd.exe /d /s /c node scripts/install.js
2024-06-25T15:01:13.951Z [err] npm error CPU-windows-3.21.1.zip
2024-06-25T15:01:13.951Z [err] npm error https://storage.googleapis.com/tensorflow/libtensorflow/libtensorflow-cpu-windows-x86_64-2.9.1.zip
2024-06-25T15:01:13.951Z [err] npm error * Downloading libtensorflow
2024-06-25T15:01:13.951Z [err] npm error
2024-06-25T15:01:13.951Z [err] npm error * Building TensorFlow Node.js bindings
2024-06-25T15:01:13.951Z [err] npm error symlink ./lib/napi-v9 failed: Error: Command failed: node scripts/deps-stage.js symlink ./lib/napi-v9
2024-06-25T15:01:13.951Z [err] npm error * Symlink of lib\napi-v9\tensorflow.dll failed, creating a copy on disk.
2024-06-25T15:01:13.951Z [err] npm error node:internal/process/promises:288
2024-06-25T15:01:13.951Z [err] npm error triggerUncaughtException(err, true /* fromPromise */);
2024-06-25T15:01:13.951Z [err] npm error ^
2024-06-25T15:01:13.951Z [err] npm error
2024-06-25T15:01:13.951Z [err] npm error [Error: ENOENT: no such file or directory, copyfile 'C:\Users\Wim\.node-red\node_modules\@tensorflow\tfjs-node\deps\lib\tensorflow.dll' -> 'C:\Users\Wim\.node-red\node_modules\@tensorflow\tfjs-node\lib\napi-v9\tensorflow.dll'] {
2024-06-25T15:01:13.951Z [err] npm error errno: -4058,
2024-06-25T15:01:13.951Z [err] npm error code: 'ENOENT',
2024-06-25T15:01:13.951Z [err] npm error syscall: 'copyfile',
2024-06-25T15:01:13.951Z [err] npm error path: 'C:\\Users\\Wim\\.node-red\\node_modules\\@tensorflow\\tfjs-node\\deps\\lib\\tensorflow.dll',
2024-06-25T15:01:13.951Z [err] npm error dest: 'C:\\Users\\Wim\\.node-red\\node_modules\\@tensorflow\\tfjs-node\\lib\\napi-v9\\tensorflow.dll'
2024-06-25T15:01:13.951Z [err] npm error }
2024-06-25T15:01:13.951Z [err] npm error
2024-06-25T15:01:13.951Z [err] npm error Node.js v18.20.3
2024-06-25T15:01:13.951Z [err] npm error
2024-06-25T15:01:13.951Z [err] npm error at ChildProcess.exithandler (node:child_process:422:12)
2024-06-25T15:01:13.951Z [err] npm error at ChildProcess.emit (node:events:517:28)
2024-06-25T15:01:13.951Z [err] npm error at maybeClose (node:internal/child_process:1098:16)
2024-06-25T15:01:13.951Z [err] npm error at ChildProcess._handle.onexit (node:internal/child_process:303:5) {
2024-06-25T15:01:13.951Z [err] npm error code: 1,
2024-06-25T15:01:13.951Z [err] npm error killed: false,
2024-06-25T15:01:13.951Z [err] npm error signal: null,
2024-06-25T15:01:13.951Z [err] npm error cmd: 'node scripts/deps-stage.js symlink ./lib/napi-v9'
2024-06-25T15:01:13.951Z [err] npm error }
2024-06-25T15:01:13.953Z [err] 
2024-06-25T15:01:13.953Z [err] npm error A complete log of this run can be found in: C:\Users\Wim\AppData\Local\npm-cache\_logs\2024-06-25T15_00_32_108Z-debug-0.log
2024-06-25T15:01:13.979Z rc=1

```

---

<div class="post-metadata">

**Author:** ![krambriw](https://sea2.discourse-cdn.com/flex026/user_avatar/discourse.nodered.org/krambriw/32/5429_2.png) [@krambriw](https://discourse.nodered.org/u/krambriw)\
**Post date:** [25 June 2024 18:23 UTC](https://discourse.nodered.org/t/object-detection-with-predefined-set-and-dahua-ip-cam/88914/4 "2024-06-25T18:23:02Z")

</div>

And your Python version??

---

<div class="post-metadata">

**Author:** ![oliver](https://avatars.discourse-cdn.com/v4/letter/o/85f322/32.png) [@oliver](https://discourse.nodered.org/u/oliver)\
**Post date:** [25 June 2024 18:43 UTC](https://discourse.nodered.org/t/object-detection-with-predefined-set-and-dahua-ip-cam/88914/5 "2024-06-25T18:43:03Z")

</div>

I have python 3.9 3.11 and 3.12 on my pc, how to know which one will be used by the nodes? Thx.

---

<div class="post-metadata">

**Author:** ![krambriw](https://sea2.discourse-cdn.com/flex026/user_avatar/discourse.nodered.org/krambriw/32/5429_2.png) [@krambriw](https://discourse.nodered.org/u/krambriw)\
**Post date:** [26 June 2024 06:12 UTC](https://discourse.nodered.org/t/object-detection-with-predefined-set-and-dahua-ip-cam/88914/6 "2024-06-26T06:12:24Z")

</div>

In the link @Steve-Mcl posted it is written "use Node.js v18.16.1" while you say you have v18.20.3 so next I would do is to get that node.js version and check if that helps

---

<div class="post-metadata">

**Author:** ![oliver](https://avatars.discourse-cdn.com/v4/letter/o/85f322/32.png) [@oliver](https://discourse.nodered.org/u/oliver)\
**Post date:** [26 June 2024 09:41 UTC](https://discourse.nodered.org/t/object-detection-with-predefined-set-and-dahua-ip-cam/88914/7 "2024-06-26T09:41:02Z")

</div>

Thanks a lot, with 18.16.1 it works on my win10 PC.

It worked also without any problems on the RP4, but slow.

Maybe RP5 + AI accelerator would be ok?

---

<div class="post-metadata">

**Author:** ![system](https://us1.discourse-cdn.com/flex026/uploads/nodered/original/1X/d073cd938eafa2e558d7c2cd59003b3ef4963033.png) [@system](https://discourse.nodered.org/u/system)\
**Post date:** [24 September 2024 09:41 UTC](https://discourse.nodered.org/t/object-detection-with-predefined-set-and-dahua-ip-cam/88914/8 "2024-09-24T09:41:23Z")

</div>

This topic was automatically closed 90 days after the last reply. New replies are no longer allowed.
